{"text_format":"1","workbook":"xlsx","n_sheets":3,"sheets":["PG Account Finder","Dropdown list items","Database for mini tool"],"not_rendered":{"charts":0,"images":2,"macros":1,"external_links":0,"defined_names":4,"comments":0,"pivot_tables":0},"unopened":[],"bounds":{"document_bytes":16777216,"sheet_cells":100000,"rows_first":2000,"rows_last":500,"rows_between":2000,"halvings":0,"cell_chars":16384,"cell_head_chars":4096},"cells_cut":0,"cells_raw":0,"read":"whole","date_system":"1900"}

{"sheet":"PG Account Finder","index":0,"n_rows":13,"n_cols":5,"rows_kept":13,"cut":false,"hidden":false,"merged":[[1,0,1,1]]}
[]
["PG Account Finder"]
["1. What is the Type of Supply?","GOODS",{"$f":"_xlfn.XOR(TRIM(A3)=\"\",TRIM(B3)=\"\")","v":false}]
[{"$f":"IF(TRIM(B3)<>\"\",\"2. What is the P&G company name that ordered the goods/services?\",\"\")","v":"2. What is the P&G company name that ordered the goods/services?"},"",{"$f":"_xlfn.XOR(TRIM(A4)=\"\",TRIM(B4)=\"\")","v":true}]
[{"$f":"IF(TRIM(B4)<>\"\",\"3. What is the goods destination/ services supplied to P&G in which country?\",\"\")","v":""},null,false]
[{"$f":"IF(TRIM(B5)<>\"\",IF(TRIM(B4)=\"Procter & Gamble Manufacturing GmbH\",\"4. What is the city?\",IF(TRIM(B4)=\"Procter & Gamble UK\",\"4. What is the PO box?\",\"\")),\"\")","v":""},null,false]
[null,{"$f":"TRIM(B3)&\"|\"&TRIM(B4)&\"|\"&TRIM(B5)&\"|\"&TRIM(B6)","v":"GOODS|||"},{"$f":"OR(C3,C4,C5,C6)","v":true}]
[]
["AAA account number:",{"$f":"IF(ISNA(VLOOKUP($B$7,'Database for mini tool'!$A:$K,6,0)),IF(NOT($C$7),\"No AAA account available\",\"\"),VLOOKUP($B$7,'Database for mini tool'!$A:$K,6,0))","v":""}]
["Billing info:",{"$f":"IF(ISNA(VLOOKUP($B$7,'Database for mini tool'!$A:$K,8,0)),\"\",VLOOKUP($B$7,'Database for mini tool'!$A:$K,8,0))","v":""}]
[]
[null,{"$f":"IF(ISNA(VLOOKUP($B$7,'Database for mini tool'!$A:$K,9,0)),\"\",VLOOKUP($B$7,'Database for mini tool'!$A:$K,9,0))","v":""}]
["VAT ID number:",{"$f":"IF(ISNA(VLOOKUP($B$7,'Database for mini tool'!$A:$K,11,0)),\"\",VLOOKUP($B$7,'Database for mini tool'!$A:$K,11,0))","v":""},null,null,"Clear form"]

{"sheet":"Dropdown list items","index":1,"n_rows":78,"n_cols":9,"rows_kept":78,"cut":false,"hidden":true,"merged":[]}
["Type","Legal Entity","LE Match","LE Match w Order Ids","LE matching items","Country","City","PO box","VAT number"]
["GOODS","Agile Pursuits Fran. Inc.",{"$f":"--ISNUMBER(IFERROR(SEARCH('PG Account Finder'!$B$4,B2,1),\"\"))","v":1},{"$f":"IF(C2=1,COUNTIF($C$2:C2,1),\"\")","v":1},{"$f":"IFERROR(INDEX($B$2:$B$76,MATCH(ROWS($D$2:D2),$D$2:$D$77,0)),\"\")","v":"Agile Pursuits Fran. Inc."},"Belgium","Procter & Gamble UK","Procter & Gamble Manufacturing GmbH","Procter & Gamble International Operations SA Singapore Branch"]
["SERVICES","Agile Pursuits, Inc",{"$f":"--ISNUMBER(IFERROR(SEARCH('PG Account Finder'!$B$4,B3,1),\"\"))","v":1},{"$f":"IF(C3=1,COUNTIF($C$2:C3,1),\"\")","v":2},{"$f":"IFERROR(INDEX($B$2:$B$76,MATCH(ROWS($D$2:D3),$D$2:$D$77,0)),\"\")","v":"Agile Pursuits, Inc"},"Canada","Crailsheim","PO BOX 135","Malaysia – 0001972326400"]
[null,"Benefit Plan Trust",{"$f":"--ISNUMBER(IFERROR(SEARCH('PG Account Finder'!$B$4,B4,1),\"\"))","v":1},{"$f":"IF(C4=1,COUNTIF($C$2:C4,1),\"\")","v":3},{"$f":"IFERROR(INDEX($B$2:$B$76,MATCH(ROWS($D$2:D4),$D$2:$D$77,0)),\"\")","v":"Benefit Plan Trust"},"Czech Republic","Euskirchen","PO BOX 77","Singapore – M90005335T"]
[null,"Braun-Gillette Immobilien GmbH & Co. KG",{"$f":"--ISNUMBER(IFERROR(SEARCH('PG Account Finder'!$B$4,B5,1),\"\"))","v":1},{"$f":"IF(C5=1,COUNTIF($C$2:C5,1),\"\")","v":4},{"$f":"IFERROR(INDEX($B$2:$B$76,MATCH(ROWS($D$2:D5),$D$2:$D$77,0)),\"\")","v":"Braun-Gillette Immobilien GmbH & Co. KG"},"France","Gross Gerau"]
[null,"Detergent Products AG",{"$f":"--ISNUMBER(IFERROR(SEARCH('PG Account Finder'!$B$4,B6,1),\"\"))","v":1},{"$f":"IF(C6=1,COUNTIF($C$2:C6,1),\"\")","v":5},{"$f":"IFERROR(INDEX($B$2:$B$76,MATCH(ROWS($D$2:D6),$D$2:$D$77,0)),\"\")","v":"Detergent Products AG"},"Germany","Huenfeld"]
[null,"Gillette UK Limited",{"$f":"--ISNUMBER(IFERROR(SEARCH('PG Account Finder'!$B$4,B7,1),\"\"))","v":1},{"$f":"IF(C7=1,COUNTIF($C$2:C7,1),\"\")","v":6},{"$f":"IFERROR(INDEX($B$2:$B$76,MATCH(ROWS($D$2:D7),$D$2:$D$77,0)),\"\")","v":"Gillette UK Limited"},"Hong Kong","Kronberg"]
[null,"GIORGIO BEVERLY HILLS, INC.",{"$f":"--ISNUMBER(IFERROR(SEARCH('PG Account Finder'!$B$4,B8,1),\"\"))","v":1},{"$f":"IF(C8=1,COUNTIF($C$2:C8,1),\"\")","v":7},{"$f":"IFERROR(INDEX($B$2:$B$76,MATCH(ROWS($D$2:D8),$D$2:$D$77,0)),\"\")","v":"GIORGIO BEVERLY HILLS, INC."},"Hungary","Marktheidenfeld"]
[null,"GRAHAM WEBB INTERNATIONAL, INC.",{"$f":"--ISNUMBER(IFERROR(SEARCH('PG Account Finder'!$B$4,B9,1),\"\"))","v":1},{"$f":"IF(C9=1,COUNTIF($C$2:C9,1),\"\")","v":8},{"$f":"IFERROR(INDEX($B$2:$B$76,MATCH(ROWS($D$2:D9),$D$2:$D$77,0)),\"\")","v":"GRAHAM WEBB INTERNATIONAL, INC."},"Malaysia","Marktheidenfeld-Altfeld"]
[null,"Hyginett Kft",{"$f":"--ISNUMBER(IFERROR(SEARCH('PG Account Finder'!$B$4,B10,1),\"\"))","v":1},{"$f":"IF(C10=1,COUNTIF($C$2:C10,1),\"\")","v":9},{"$f":"IFERROR(INDEX($B$2:$B$76,MATCH(ROWS($D$2:D10),$D$2:$D$77,0)),\"\")","v":"Hyginett Kft"},"Netherlands","Schwalbach am Taunus"]
[null,"Laboratorios Vicks SL",{"$f":"--ISNUMBER(IFERROR(SEARCH('PG Account Finder'!$B$4,B11,1),\"\"))","v":1},{"$f":"IF(C11=1,COUNTIF($C$2:C11,1),\"\")","v":10},{"$f":"IFERROR(INDEX($B$2:$B$76,MATCH(ROWS($D$2:D11),$D$2:$D$77,0)),\"\")","v":"Laboratorios Vicks SL"},"Singapore","Steinberg"]
[null,"Olay  LLC",{"$f":"--ISNUMBER(IFERROR(SEARCH('PG Account Finder'!$B$4,B12,1),\"\"))","v":1},{"$f":"IF(C12=1,COUNTIF($C$2:C12,1),\"\")","v":11},{"$f":"IFERROR(INDEX($B$2:$B$76,MATCH(ROWS($D$2:D12),$D$2:$D$77,0)),\"\")","v":"Olay  LLC"},"Spain","Wallduern"]
[null,"Olay LLC",{"$f":"--ISNUMBER(IFERROR(SEARCH('PG Account Finder'!$B$4,B13,1),\"\"))","v":1},{"$f":"IF(C13=1,COUNTIF($C$2:C13,1),\"\")","v":12},{"$f":"IFERROR(INDEX($B$2:$B$76,MATCH(ROWS($D$2:D13),$D$2:$D$77,0)),\"\")","v":"Olay LLC"},"Switzerland","Weiterstadt"]
[null,"ORAL-B LABORATORIES G.P.",{"$f":"--ISNUMBER(IFERROR(SEARCH('PG Account Finder'!$B$4,B14,1),\"\"))","v":1},{"$f":"IF(C14=1,COUNTIF($C$2:C14,1),\"\")","v":13},{"$f":"IFERROR(INDEX($B$2:$B$76,MATCH(ROWS($D$2:D14),$D$2:$D$77,0)),\"\")","v":"ORAL-B LABORATORIES G.P."},"United Kingdom","Worms"]
[null,"P&G HONG KONG LTD",{"$f":"--ISNUMBER(IFERROR(SEARCH('PG Account Finder'!$B$4,B15,1),\"\"))","v":1},{"$f":"IF(C15=1,COUNTIF($C$2:C15,1),\"\")","v":14},{"$f":"IFERROR(INDEX($B$2:$B$76,MATCH(ROWS($D$2:D15),$D$2:$D$77,0)),\"\")","v":"P&G HONG KONG LTD"},"United States"]
[null,"P&G Manufacturing Co.",{"$f":"--ISNUMBER(IFERROR(SEARCH('PG Account Finder'!$B$4,B16,1),\"\"))","v":1},{"$f":"IF(C16=1,COUNTIF($C$2:C16,1),\"\")","v":15},{"$f":"IFERROR(INDEX($B$2:$B$76,MATCH(ROWS($D$2:D16),$D$2:$D$77,0)),\"\")","v":"P&G Manufacturing Co."}]
[null,"P&G Northeast Asia Pte Ltd",{"$f":"--ISNUMBER(IFERROR(SEARCH('PG Account Finder'!$B$4,B17,1),\"\"))","v":1},{"$f":"IF(C17=1,COUNTIF($C$2:C17,1),\"\")","v":16},{"$f":"IFERROR(INDEX($B$2:$B$76,MATCH(ROWS($D$2:D17),$D$2:$D$77,0)),\"\")","v":"P&G Northeast Asia Pte Ltd"}]
[null,"P&G Paper Products Co",{"$f":"--ISNUMBER(IFERROR(SEARCH('PG Account Finder'!$B$4,B18,1),\"\"))","v":1},{"$f":"IF(C18=1,COUNTIF($C$2:C18,1),\"\")","v":17},{"$f":"IFERROR(INDEX($B$2:$B$76,MATCH(ROWS($D$2:D18),$D$2:$D$77,0)),\"\")","v":"P&G Paper Products Co"}]
[null,"P&G Prestige Service GmbH",{"$f":"--ISNUMBER(IFERROR(SEARCH('PG Account Finder'!$B$4,B19,1),\"\"))","v":1},{"$f":"IF(C19=1,COUNTIF($C$2:C19,1),\"\")","v":18},{"$f":"IFERROR(INDEX($B$2:$B$76,MATCH(ROWS($D$2:D19),$D$2:$D$77,0)),\"\")","v":"P&G Prestige Service GmbH"}]
[null,"PGT Healthcare LLP",{"$f":"--ISNUMBER(IFERROR(SEARCH('PG Account Finder'!$B$4,B20,1),\"\"))","v":1},{"$f":"IF(C20=1,COUNTIF($C$2:C20,1),\"\")","v":19},{"$f":"IFERROR(INDEX($B$2:$B$76,MATCH(ROWS($D$2:D20),$D$2:$D$77,0)),\"\")","v":"PGT Healthcare LLP"}]
[null,"Procter & Gamble – Rakona s.r.o.",{"$f":"--ISNUMBER(IFERROR(SEARCH('PG Account Finder'!$B$4,B21,1),\"\"))","v":1},{"$f":"IF(C21=1,COUNTIF($C$2:C21,1),\"\")","v":20},{"$f":"IFERROR(INDEX($B$2:$B$76,MATCH(ROWS($D$2:D21),$D$2:$D$77,0)),\"\")","v":"Procter & Gamble – Rakona s.r.o."}]
[null,"Procter & Gamble (Malaysia) Sdn. Bhd. ",{"$f":"--ISNUMBER(IFERROR(SEARCH('PG Account Finder'!$B$4,B22,1),\"\"))","v":1},{"$f":"IF(C22=1,COUNTIF($C$2:C22,1),\"\")","v":21},{"$f":"IFERROR(INDEX($B$2:$B$76,MATCH(ROWS($D$2:D22),$D$2:$D$77,0)),\"\")","v":"Procter & Gamble (Malaysia) Sdn. Bhd. "}]
[null,"Procter & Gamble Acquisition GmbH ",{"$f":"--ISNUMBER(IFERROR(SEARCH('PG Account Finder'!$B$4,B23,1),\"\"))","v":1},{"$f":"IF(C23=1,COUNTIF($C$2:C23,1),\"\")","v":22},{"$f":"IFERROR(INDEX($B$2:$B$76,MATCH(ROWS($D$2:D23),$D$2:$D$77,0)),\"\")","v":"Procter & Gamble Acquisition GmbH "}]
[null,"Procter & Gamble Blois SAS",{"$f":"--ISNUMBER(IFERROR(SEARCH('PG Account Finder'!$B$4,B24,1),\"\"))","v":1},{"$f":"IF(C24=1,COUNTIF($C$2:C24,1),\"\")","v":23},{"$f":"IFERROR(INDEX($B$2:$B$76,MATCH(ROWS($D$2:D24),$D$2:$D$77,0)),\"\")","v":"Procter & Gamble Blois SAS"}]
[null,"Procter & Gamble Company",{"$f":"--ISNUMBER(IFERROR(SEARCH('PG Account Finder'!$B$4,B25,1),\"\"))","v":1},{"$f":"IF(C25=1,COUNTIF($C$2:C25,1),\"\")","v":24},{"$f":"IFERROR(INDEX($B$2:$B$76,MATCH(ROWS($D$2:D25),$D$2:$D$77,0)),\"\")","v":"Procter & Gamble Company"}]
[null,"Procter & Gamble Distribution Company Europe BVBA",{"$f":"--ISNUMBER(IFERROR(SEARCH('PG Account Finder'!$B$4,B26,1),\"\"))","v":1},{"$f":"IF(C26=1,COUNTIF($C$2:C26,1),\"\")","v":25},{"$f":"IFERROR(INDEX($B$2:$B$76,MATCH(ROWS($D$2:D26),$D$2:$D$77,0)),\"\")","v":"Procter & Gamble Distribution Company Europe BVBA"}]
[null,"Procter & Gamble España SA",{"$f":"--ISNUMBER(IFERROR(SEARCH('PG Account Finder'!$B$4,B27,1),\"\"))","v":1},{"$f":"IF(C27=1,COUNTIF($C$2:C27,1),\"\")","v":26},{"$f":"IFERROR(INDEX($B$2:$B$76,MATCH(ROWS($D$2:D27),$D$2:$D$77,0)),\"\")","v":"Procter & Gamble España SA"}]
[null,"Procter & Gamble Europe SA",{"$f":"--ISNUMBER(IFERROR(SEARCH('PG Account Finder'!$B$4,B28,1),\"\"))","v":1},{"$f":"IF(C28=1,COUNTIF($C$2:C28,1),\"\")","v":27},{"$f":"IFERROR(INDEX($B$2:$B$76,MATCH(ROWS($D$2:D28),$D$2:$D$77,0)),\"\")","v":"Procter & Gamble Europe SA"}]
[null,"Procter & Gamble Europe SA Singapore Branch",{"$f":"--ISNUMBER(IFERROR(SEARCH('PG Account Finder'!$B$4,B29,1),\"\"))","v":1},{"$f":"IF(C29=1,COUNTIF($C$2:C29,1),\"\")","v":28},{"$f":"IFERROR(INDEX($B$2:$B$76,MATCH(ROWS($D$2:D29),$D$2:$D$77,0)),\"\")","v":"Procter & Gamble Europe SA Singapore Branch"}]
[null,"PROCTER & GAMBLE FAR EAST, INC.",{"$f":"--ISNUMBER(IFERROR(SEARCH('PG Account Finder'!$B$4,B30,1),\"\"))","v":1},{"$f":"IF(C30=1,COUNTIF($C$2:C30,1),\"\")","v":29},{"$f":"IFERROR(INDEX($B$2:$B$76,MATCH(ROWS($D$2:D30),$D$2:$D$77,0)),\"\")","v":"PROCTER & GAMBLE FAR EAST, INC."}]
[null,"Procter & Gamble France SAS",{"$f":"--ISNUMBER(IFERROR(SEARCH('PG Account Finder'!$B$4,B31,1),\"\"))","v":1},{"$f":"IF(C31=1,COUNTIF($C$2:C31,1),\"\")","v":30},{"$f":"IFERROR(INDEX($B$2:$B$76,MATCH(ROWS($D$2:D31),$D$2:$D$77,0)),\"\")","v":"Procter & Gamble France SAS"}]
[null,"Procter & Gamble Germany GmbH",{"$f":"--ISNUMBER(IFERROR(SEARCH('PG Account Finder'!$B$4,B32,1),\"\"))","v":1},{"$f":"IF(C32=1,COUNTIF($C$2:C32,1),\"\")","v":31},{"$f":"IFERROR(INDEX($B$2:$B$76,MATCH(ROWS($D$2:D32),$D$2:$D$77,0)),\"\")","v":"Procter & Gamble Germany GmbH"}]
[null,"Procter & Gamble Germany GmbH & Co Operations OHG",{"$f":"--ISNUMBER(IFERROR(SEARCH('PG Account Finder'!$B$4,B33,1),\"\"))","v":1},{"$f":"IF(C33=1,COUNTIF($C$2:C33,1),\"\")","v":32},{"$f":"IFERROR(INDEX($B$2:$B$76,MATCH(ROWS($D$2:D33),$D$2:$D$77,0)),\"\")","v":"Procter & Gamble Germany GmbH & Co Operations OHG"}]
[null,"Procter & Gamble GmbH",{"$f":"--ISNUMBER(IFERROR(SEARCH('PG Account Finder'!$B$4,B34,1),\"\"))","v":1},{"$f":"IF(C34=1,COUNTIF($C$2:C34,1),\"\")","v":33},{"$f":"IFERROR(INDEX($B$2:$B$76,MATCH(ROWS($D$2:D34),$D$2:$D$77,0)),\"\")","v":"Procter & Gamble GmbH"}]
[null,"Procter & Gamble Grundstucks und Vermogensverwaltungs GmbH & Co. KG",{"$f":"--ISNUMBER(IFERROR(SEARCH('PG Account Finder'!$B$4,B35,1),\"\"))","v":1},{"$f":"IF(C35=1,COUNTIF($C$2:C35,1),\"\")","v":34},{"$f":"IFERROR(INDEX($B$2:$B$76,MATCH(ROWS($D$2:D35),$D$2:$D$77,0)),\"\")","v":"Procter & Gamble Grundstucks und Vermogensverwaltungs GmbH & Co. KG"}]
[null,"PROCTER & GAMBLE HAIR CARE LLC",{"$f":"--ISNUMBER(IFERROR(SEARCH('PG Account Finder'!$B$4,B36,1),\"\"))","v":1},{"$f":"IF(C36=1,COUNTIF($C$2:C36,1),\"\")","v":35},{"$f":"IFERROR(INDEX($B$2:$B$76,MATCH(ROWS($D$2:D36),$D$2:$D$77,0)),\"\")","v":"PROCTER & GAMBLE HAIR CARE LLC"}]
[null,"Procter & Gamble Holding France SAS",{"$f":"--ISNUMBER(IFERROR(SEARCH('PG Account Finder'!$B$4,B37,1),\"\"))","v":1},{"$f":"IF(C37=1,COUNTIF($C$2:C37,1),\"\")","v":36},{"$f":"IFERROR(INDEX($B$2:$B$76,MATCH(ROWS($D$2:D37),$D$2:$D$77,0)),\"\")","v":"Procter & Gamble Holding France SAS"}]
[null,"Procter & Gamble Holding GmbH",{"$f":"--ISNUMBER(IFERROR(SEARCH('PG Account Finder'!$B$4,B38,1),\"\"))","v":1},{"$f":"IF(C38=1,COUNTIF($C$2:C38,1),\"\")","v":37},{"$f":"IFERROR(INDEX($B$2:$B$76,MATCH(ROWS($D$2:D38),$D$2:$D$77,0)),\"\")","v":"Procter & Gamble Holding GmbH"}]
[null,"Procter & Gamble Inc",{"$f":"--ISNUMBER(IFERROR(SEARCH('PG Account Finder'!$B$4,B39,1),\"\"))","v":1},{"$f":"IF(C39=1,COUNTIF($C$2:C39,1),\"\")","v":38},{"$f":"IFERROR(INDEX($B$2:$B$76,MATCH(ROWS($D$2:D39),$D$2:$D$77,0)),\"\")","v":"Procter & Gamble Inc"}]
[null,"Procter & Gamble Inc.  - Wella Division",{"$f":"--ISNUMBER(IFERROR(SEARCH('PG Account Finder'!$B$4,B40,1),\"\"))","v":1},{"$f":"IF(C40=1,COUNTIF($C$2:C40,1),\"\")","v":39},{"$f":"IFERROR(INDEX($B$2:$B$76,MATCH(ROWS($D$2:D40),$D$2:$D$77,0)),\"\")","v":"Procter & Gamble Inc.  - Wella Division"}]
{"$rows_left_out":39}
{"sheet":"Database for mini tool","index":2,"n_rows":187,"n_cols":12,"rows_kept":187,"cut":false,"hidden":true,"merged":[[0,5,0,10],[0,1,0,4]]}
["Option","SUPPLIER input",null,null,null,"RESULTS - OUTPUT"]
["ID","TYPE","ORDER BY (Legal Entity)","DESTINATION (SHIP TO)","CITY","AAA account ","LE","PG name","Company address","Country","VAT ID"]
[{"$f":"B3&\"|\"&C3&\"|\"&D3&\"|\"&E3","v":"GOODS|Procter & Gamble International Operations SA|Belgium|"},"GOODS","Procter & Gamble International Operations SA","Belgium",null,"AAA653300376",800,"Procter & Gamble International Operations SA","PO Box 999, 47 Route de Saint Georges\n1213 Petit Lancy, Switzerland, c/o Fiscal Representative, Procter & Gamble Manufacturing Belgium NV, Temselaan 55, Strombeek Bever B-1853, Belgium","Belgium ","BE 0.471.948.550"]
[{"$f":"B4&\"|\"&C4&\"|\"&D4&\"|\"&E4","v":"GOODS|Procter & Gamble International Operations SA|Czech Republic|"},"GOODS","Procter & Gamble International Operations SA","Czech Republic",null,"AAA412339624",800,"Procter & Gamble International Operations SA","Route De Saint-Georges 47,\nPetit-Lancy, CH 1213, Geneva, Switzerland","Czech Republic","CZ680454432"]
["GOODS|Procter & Gamble International Operations SA|France|","GOODS","Procter & Gamble International Operations SA","France",null,"AAA755944923",800,"Procter & Gamble International Operations SA","PO Box 999, 47 Route de Saint Georges\n1213 Petit Lancy, Switzerland\nc/o Fiscal Representative Procter & Gamble Holding France SAS\n163 Quai Aulagnier 92600 Asnieres Sur Seine. France","France","FR87431438662"]
["GOODS|Procter & Gamble International Operations SA|Germany|","GOODS","Procter & Gamble International Operations SA","Germany",null,"AAA165551755",800,"Procter & Gamble International Operations SA","47, Route de Saint Georges, 1213 Petit Lancy, Switzerland","Germany","DE 812962775"]
["GOODS|Procter & Gamble International Operations SA|Hungary|","GOODS","Procter & Gamble International Operations SA","Hungary",null,"AAA745096719",800,"Procter & Gamble International Operations SA","47, Petit-Lancy CH 1213, Geneva\nSwitzerland, Reg No CH-170-3007610-6","Hungary","HU26950709"]
["GOODS|Procter & Gamble International Operations SA|Netherlands|","GOODS","Procter & Gamble International Operations SA","Netherlands",null,"AAA008556417",800,"Procter & Gamble International Operations SA","PO Box 999, 47 Route de Saint Georges\n1213 Petit Lancy, Switzerland\nc/o Fiscal Representative\nP&G Nederland BV\nWatermanweg 100, 3067 GG Rotterdam, Netherlands","Netherlands","NL808751517B01"]
["GOODS|Procter & Gamble International Operations SA|Spain|","GOODS","Procter & Gamble International Operations SA","Spain",null,"AAA292926425",800,"Procter & Gamble International Operations SA","47, Route de Saint Georges, 1213 Petit Lancy, Switzerland \nc/o Representante Fiscal, Procter & Gamble Espana SA, \nAvenida de Bruselas 24, 28108 Madrid, Spain","Spain","ES N0391140A"]
["GOODS|Procter & Gamble International Operations SA|Switzerland|","GOODS","Procter & Gamble International Operations SA","Switzerland",null,"AAA958881831",800,"Procter & Gamble International Operations SA","47 Route de Saint Georges, \n1213 Petit Lancy","Switzerland","CHE-107.889.864 TVA"]
["SERVICES|Procter & Gamble International Operations SA|Switzerland|","SERVICES","Procter & Gamble International Operations SA","Switzerland",null,"AAA958881831",800,"Procter & Gamble International Operations SA","47 Route de Saint Georges, \n1213 Petit Lancy","Switzerland","CHE-107.889.864 TVA"]
["GOODS|Procter & Gamble International Operations SA|United Kingdom|","GOODS","Procter & Gamble International Operations SA","United Kingdom",null,"AAA561172610",800,"Procter & Gamble International Operations SA","PO Box 999, 47 Route de Saint Georges\n1213 Petit Lancy, Switzerland\n","United Kingdom","GB 176 4248 87"]
["GOODS|Procter & Gamble – Rakona s.r.o.|Czech Republic|","GOODS","Procter & Gamble – Rakona s.r.o.","Czech Republic",null,"AAA210627501",300,"Procter & Gamble – Rakona s.r.o.","Procter & Gamble – Rakona s.r.o.\nOttova 402\n26932 Rakovnik","Czech Republic","CZ14801396"]
["SERVICES|Procter & Gamble – Rakona s.r.o.|Czech Republic|","SERVICES","Procter & Gamble – Rakona s.r.o.","Czech Republic",null,"AAA210627501",300,"Procter & Gamble – Rakona s.r.o.","Procter & Gamble – Rakona s.r.o.\nOttova 402\n26932 Rakovnik","Czech Republic","CZ14801396"]
["GOODS|Procter & Gamble Pharmaceuticals France SAS|France|","GOODS","Procter & Gamble Pharmaceuticals France SAS","France",null,"AAA589552256",307,"Procter & Gamble Pharmaceuticals France SAS","164 Quai Aulagnier, 92600 Asnieres Sur Seine, France\n","France","FR 18572020642"]
["SERVICES|Procter & Gamble Pharmaceuticals France SAS|France|","SERVICES","Procter & Gamble Pharmaceuticals France SAS","France",null,"AAA589552256",307,"Procter & Gamble Pharmaceuticals France SAS","164 Quai Aulagnier, 92600 Asnieres Sur Seine, France\n","France","FR 18572020642"]
["GOODS|Procter & Gamble Holding France SAS|France|","GOODS","Procter & Gamble Holding France SAS","France",null,"AAA660055476",310,"Procter & Gamble Holding France SAS","TSA 72200, 163 Quai Aulagnier, 92600 Asnieres Sur Seine, France\n","France","FR 43542106109"]
["SERVICES|Procter & Gamble Holding France SAS|France|","SERVICES","Procter & Gamble Holding France SAS","France",null,"AAA660055476",310,"Procter & Gamble Holding France SAS","TSA 72200, 163 Quai Aulagnier, 92600 Asnieres Sur Seine, France\n","France","FR 43542106109"]
["GOODS|Procter & Gamble Holding GmbH|Germany|","GOODS","Procter & Gamble Holding GmbH","Germany",null,"AAA036507374",330,"Procter & Gamble Holding GmbH","CAPA, Sulzbacher Str.40-50, 65823 Schwalbach a. Ts, Germany","Germany","DE 113823034"]
["SERVICES|Procter & Gamble Holding GmbH|Germany|","SERVICES","Procter & Gamble Holding GmbH","Germany",null,"AAA036507374",330,"Procter & Gamble Holding GmbH","CAPA, Sulzbacher Str.40-50, 65823 Schwalbach a. Ts, Germany","Germany","DE 113823034"]
["GOODS|Procter & Gamble GmbH|Germany|","GOODS","Procter & Gamble GmbH","Germany",null,"AAA783675150",335,"Procter & Gamble GmbH","CAPA, Sulzbacher Str.40-50, 65824 Schwalbach am Taunus, Germany ","Germany","DE 811133976 "]
["SERVICES|Procter & Gamble GmbH|Germany|","SERVICES","Procter & Gamble GmbH","Germany",null,"AAA783675150",335,"Procter & Gamble GmbH","CAPA, Sulzbacher Str.40-50, 65824 Schwalbach am Taunus, Germany ","Germany","DE 811133976 "]
["GOODS|Hyginett Kft|Hungary|","GOODS","Hyginett Kft","Hungary",null,"AAA989269535",344,"Hyginett Kft","Hyginett Kft\nHatár út 3, 2141 Csömör, Hungary","Hungary","HU10523667"]
["SERVICES|Hyginett Kft|Hungary|","SERVICES","Hyginett Kft","Hungary",null,"AAA989269535",344,"Hyginett Kft","Hyginett Kft\nHatár út 3, 2141 Csömör, Hungary","Hungary","HU10523667"]
["GOODS|Procter & Gamble Magyarország Nagykereskedelmi Kkt.|Hungary|","GOODS","Procter & Gamble Magyarország Nagykereskedelmi Kkt.","Hungary",null,"AAA682665294",345,"Procter & Gamble Magyarország Nagykereskedelmi Kkt.","Procter & Gamble Magyarország Nagykereskedelmi Kkt.\n1134 Budapest, Váci út 35., Hungary","Hungary","HU28160447"]
["GOODS|Procter & Gamble Magyarország Nagykereskedelmi Kkt.|Hungary|","GOODS","Procter & Gamble Magyarország Nagykereskedelmi Kkt.","Hungary",null,"AAA682665294",345,"Procter & Gamble Magyarország Nagykereskedelmi Kkt.","Procter & Gamble Magyarország Nagykereskedelmi Kkt.\n1134 Budapest, Váci út 35., Hungary","Hungary","HU28160447"]
["GOODS|Procter & Gamble Mataró SL|Spain|","GOODS","Procter & Gamble Mataró SL","Spain",null,"AAA085770667",423,"Procter & Gamble Mataró SL","Avenida de Bruselas 24, 28108 Alcobendas, Madrid, Spain\n","Spain","ES B82378431"]
["SERVICES|Procter & Gamble Mataró SL|Spain|","SERVICES","Procter & Gamble Mataró SL","Spain",null,"AAA085770667",423,"Procter & Gamble Mataró SL","Avenida de Bruselas 24, 28108 Alcobendas, Madrid, Spain\n","Spain","ES B82378431"]
["GOODS|Procter & Gamble Switzerland SARL|Switzerland|","GOODS","Procter & Gamble Switzerland SARL","Switzerland",null,"AAA847130861",430,"Procter & Gamble Switzerland SARL","47, Route de Saint Georges, 1213 Petit Lancy, Switzerland","Switzerland","CHE-105.530.062 TVA "]
["SERVICES|Procter & Gamble Switzerland SARL|Switzerland|","SERVICES","Procter & Gamble Switzerland SARL","Switzerland",null,"AAA847130861",430,"Procter & Gamble Switzerland SARL","47, Route de Saint Georges, 1213 Petit Lancy, Switzerland","Switzerland","CHE-105.530.062 TVA "]
["GOODS|Detergent Products AG|Switzerland|","GOODS","Detergent Products AG","Switzerland",null,"AAA631681756",431,"Detergent Products AG","47, Route de Saint Georges, 1213 Petit Lancy, Switzerland\n","Switzerland","CHE108.814.490 TVA"]
["SERVICES|Detergent Products AG|Switzerland|","SERVICES","Detergent Products AG","Switzerland",null,"AAA631681756",431,"Detergent Products AG","47, Route de Saint Georges, 1213 Petit Lancy, Switzerland\n","Switzerland","CHE108.814.490 TVA"]
["GOODS|Procter & Gamble Nederland BV|Netherlands|","GOODS","Procter & Gamble Nederland BV","Netherlands",null,"AAA793903865",505,"Procter & Gamble Nederland BV","Watermanweg 100, 3067 GG, Rotterdam, Netherlands","Netherlands","NL 002980381 B01 "]
["SERVICES|Procter & Gamble Nederland BV|Netherlands|","SERVICES","Procter & Gamble Nederland BV","Netherlands",null,"AAA793903865",505,"Procter & Gamble Nederland BV","Watermanweg 100, 3067 GG, Rotterdam, Netherlands","Netherlands","NL 002980381 B01 "]
["GOODS|Procter & Gamble Distribution Company Europe BVBA|Belgium|","GOODS","Procter & Gamble Distribution Company Europe BVBA","Belgium",null,"AAA850545401",511,"Procter & Gamble Distribution Company Europe BVBA","Temselaan 100, 1853 Strombeek-Bever, Belgium","Belgium ","BE 0.458.138.225"]
["SERVICES|Procter & Gamble Distribution Company Europe BVBA|Belgium|","SERVICES","Procter & Gamble Distribution Company Europe BVBA","Belgium",null,"AAA850545401",511,"Procter & Gamble Distribution Company Europe BVBA","Temselaan 100, 1853 Strombeek-Bever, Belgium","Belgium ","BE 0.458.138.225"]
["GOODS|Procter & Gamble France SAS|France|","GOODS","Procter & Gamble France SAS","France",null,"AAA084784800",577,"Procter & Gamble France SAS","TSA 72200, 163 Quai Aulagnier, 92600 Asnieres Sur Seine, France\n","France","FR 25391543576"]
["SERVICES|Procter & Gamble France SAS|France|","SERVICES","Procter & Gamble France SAS","France",null,"AAA084784800",577,"Procter & Gamble France SAS","TSA 72200, 163 Quai Aulagnier, 92600 Asnieres Sur Seine, France\n","France","FR 25391543576"]
["GOODS|Procter and Gamble Amiens SAS  |France|","GOODS","Procter and Gamble Amiens SAS  ","France",null,"AAA683422513",579,"Procter and Gamble Amiens SAS  ","TSA 51100, 163 Quai Aulagnier, 92600 Asnieres Sur Seine, France","France","FR 60391548955"]
["SERVICES|Procter and Gamble Amiens SAS  |France|","SERVICES","Procter and Gamble Amiens SAS  ","France",null,"AAA683422513",579,"Procter and Gamble Amiens SAS  ","TSA 51100, 163 Quai Aulagnier, 92600 Asnieres Sur Seine, France","France","FR 60391548955"]
{"$rows_left_out":147}